{"text_format":"1","workbook":"xlsx","n_sheets":13,"sheets":["Instructions","FAQs","Summary","Variances","Warnings","Labour Expenditure","Contract Expenditure","Plant Expenditure","SMP-PMP Expenditure","Prototype Expenditure","Other Expenditure","Cash Flow","Guidelines"],"not_rendered":{"charts":0,"images":5,"macros":1,"external_links":2,"defined_names":34,"comments":0,"pivot_tables":0},"unopened":[],"bounds":{"document_bytes":16777216,"sheet_cells":100000,"rows_first":2000,"rows_last":500,"rows_between":2000,"halvings":0,"cell_chars":16384,"cell_head_chars":4096},"cells_cut":0,"cells_raw":0,"read":"whole","date_system":"1900"}

{"sheet":"Instructions","index":0,"n_rows":48,"n_cols":5,"rows_kept":48,"cut":false,"hidden":false,"merged":[[28,4,28,13],[45,3,45,13],[47,3,47,13],[34,4,34,13],[36,4,36,13],[38,4,38,13],[40,3,40,13],[30,4,30,13],[32,4,32,13],[42,3,42,13],[10,2,10,13],[26,4,26,13],[4,2,4,13],[6,2,6,13],[8,2,8,13],[20,3,20,13],[22,4,22,13],[24,4,24,13],[14,3,14,13],[15,3,15,13],[18,3,18,13]]}
[]
[null,null,"Instructions for Completing the Budget Calculator"]
[]
[]
[null,null,"This budget calculator has been provided to assist you in calculating eligible expenditure for an Accelerating Commercialisation Grant."]
[]
{"$rows_left_out":43}
{"sheet":"FAQs","index":1,"n_rows":46,"n_cols":3,"rows_kept":46,"cut":false,"hidden":false,"merged":[[45,2,45,10],[40,2,40,10],[41,2,41,10],[43,2,43,10],[39,2,39,10],[44,2,44,10],[37,2,37,10],[36,2,36,10],[35,2,35,10],[25,2,25,10],[23,2,23,10],[30,2,30,10],[32,2,32,10],[34,2,34,10],[33,2,33,10],[31,2,31,10],[29,2,29,10],[22,2,22,10],[24,2,24,10],[26,2,26,10],[28,2,28,10],[27,2,27,10],[11,2,11,10],[17,2,17,10],[21,2,21,10],[7,2,7,10],[3,2,3,10],[4,2,4,10],[8,2,8,10],[10,2,10,10],[12,2,12,10],[13,2,13,10],[14,2,14,10],[20,2,20,10],[19,2,19,10],[15,2,15,10],[16,2,16,10],[18,2,18,10],[1,2,1,10],[5,2,5,10],[6,2,6,10],[9,2,9,10],[2,2,2,10]]}
[]
[null,null,"Accelerating Commercialisation Budget Calculator - Frequently Asked Questions"]
[]
[null,null,"Do macros have to be enabled in order to use the budget calculator?"]
[]
[null,null,"Yes. Macros must be enabled in order the use the budget calculator. The security level for macros should be set at medium or lower for the budget calculator to work. For Excel 2010 users, the security macro level can be modified via Windows Office Button; Excel Options; Trust Centre; Trust Centre Settings; Macro Settings. Please remember to save it as an 'xlsm' (Macro Enabled) instead of an 'xlsx' (Macro Disabled) file. If you do save the calculator as an xlsx, the macros are deleted and the budget calculator will no longer operate correctly. To fix this requires a new version of the budget calculator and re-entry of the data."]
{"$rows_left_out":41}
{"sheet":"Summary","index":2,"n_rows":64,"n_cols":31,"rows_kept":64,"cut":false,"hidden":false,"merged":[[10,0,10,2],[11,0,11,1],[23,1,23,3],[24,1,24,3],[25,1,25,3],[19,1,22,2],[17,0,17,2],[39,1,39,3],[26,1,26,3],[27,1,27,3],[28,1,28,3],[31,0,31,1],[29,1,29,3]]}
["Accelerating Commercialisation",null,null,null,null,null,"Please Select","Yes","No"]
["Project Budget Calculator",null,"AC Version 2.5 Excel 2010 onwards"]
["Company Name:"]
["Enter Project Start Date:"]
["Enter Project End Date:",null,null,null,null,{"$f":"B56","v":"3799-07-01"},{"$f":"F5","v":"3799-07-01"}]
["Version Number:"]
{"$rows_left_out":59}
{"sheet":"Variances","index":3,"n_rows":64,"n_cols":30,"rows_kept":64,"cut":false,"hidden":true,"merged":[[11,0,11,1],[19,1,22,2],[29,1,29,3],[43,1,46,2],[53,1,53,3],[12,0,12,1]]}
["Accelerating Commercialisation"]
["Project Expenditure Calculator"]
["Company Name"]
["Enter Project Start Date:"]
["Enter Project End Date:"]
["Version Number:"]
{"$rows_left_out":59}
{"sheet":"Warnings","index":4,"n_rows":45,"n_cols":20,"rows_kept":45,"cut":false,"hidden":false,"merged":[[4,3,4,9],[5,3,5,9],[6,3,6,9],[7,3,7,9],[15,3,15,9],[14,3,14,9],[8,3,8,9],[9,3,9,9],[10,3,10,9]]}
["Accelerating Commercialisation"]
[]
["Warnings where expenditure appears outside guidelines"]
[]
[null,null,null,"The nature of the organisation on the Summary page must be specified",null,null,null,null,null,null,{"$f":"IF(Summary!C12=\"Please Select\",\"WARNING - NOT WITHIN ELIGIBLE EXPENDITURE GUIDELINES, PLEASE AMEND\",\"OK - CURRENT INFORMATION IS WITHIN ELIGIBLE EXPENDITURE GUIDELINES\")","v":"OK - CURRENT INFORMATION IS WITHIN ELIGIBLE EXPENDITURE GUIDELINES"}]
[null,null,null,"Project period must not commence before 1/11/2014",null,null,null,null,null,null,{"$f":"IF(Summary!C4=0,\"OK - CURRENT INFORMATION IS WITHIN ELIGIBLE EXPENDITURE GUIDELINES\",IF(AND(Summary!C4>=O6,Summary!C5<=P6),\"OK - CURRENT INFORMATION IS WITHIN ELIGIBLE EXPENDITURE GUIDELINES\",\"WARNING - NOT WITHIN ELIGIBLE EXPENDITURE GUIDELINES, PLEASE AMEND\"))","v":"OK - CURRENT INFORMATION IS WITHIN ELIGIBLE EXPENDITURE GUIDELINES"},null,null,null,"2014-11-01","2030-06-30",{"$f":"IF(K6=\"WARNING - NOT WITHIN ELIGIBLE EXPENDITURE GUIDELINES, PLEASE AMEND\",1,0)","v":0}]
{"$rows_left_out":40}
{"sheet":"Labour Expenditure","index":5,"n_rows":59,"n_cols":193,"rows_kept":59,"cut":false,"hidden":false,"merged":[[11,2,11,3],[11,4,11,5],[6,4,8,5],[9,4,9,5],[52,14,52,17],[40,14,40,17],[50,5,50,7],[49,2,49,11],[47,3,47,7],[31,10,33,11],[31,9,33,9],[36,10,36,11],[36,2,36,9],[35,10,35,11],[34,10,34,11],[35,2,35,9],[31,8,33,8],[34,2,34,9],[31,7,33,7],[31,2,33,2],[31,4,33,4],[7,61,7,64],[7,43,7,45],[19,43,19,53],[6,7,8,7],[9,2,9,3],[10,2,10,3],[10,4,10,5],[13,2,13,3],[6,8,8,8],[6,6,8,6],[13,4,13,5],[18,2,20,3],[6,2,8,3],[6,9,8,9],[12,2,12,3],[12,4,12,5],[30,14,30,17],[22,2,22,3],[21,2,21,3],[18,4,20,5],[18,6,20,6],[23,4,23,5],[18,10,20,10],[18,11,20,11],[18,9,20,9],[25,2,25,3],[24,2,24,3],[25,4,25,5],[22,4,22,5],[23,2,23,3],[24,4,24,5],[21,4,21,5],[5,14,5,17],[18,7,20,7],[6,11,8,11],[6,10,8,10],[17,14,17,17],[18,8,20,8]]}
[null,{"$f":"IF(Summary!C3=\"\",\"\",Summary!C3)","v":""},null,{"$f":"Summary!C5","v":"00:00:00"},null,"Project Period:",null,{"$f":"Summary!$C$4","v":"00:00:00"},"to",{"$f":"Summary!$C$5","v":"00:00:00"},null,null,null,null,null,null,null,null,null,null,null,null,null,null,null,null,null,null,null,null,null,null,null,null,null,null,null,null,null,null,null,null,"Year","Year",{"$f":"YEAR(AS2)","v":3799},3799,3800,3800,3800,3800,3801,3801,3801,3801,3802,3802,3802,3802,3803,3803,3803]
[null,"1. Labour Expenditure",null,null,null,null,"Project Period:",null,null,null,null,null,null,null,"2004-07-01","2005-07-01","2006-07-01","2007-07-01",null,null,null,null,null,null,null,null,null,null,null,null,null,null,null,null,null,null,null,null,null,null,null,null,"Start Q","Start Q",{"$f":"Summary!F5","v":"3799-07-01"},{"$f":"AS4","v":"3799-10-01"},{"$f":"AT4","v":"3800-01-01"},"3800-04-01","3800-07-01","3800-10-01","3801-01-01","3801-04-01","3801-07-01","3801-10-01","3802-01-01","3802-04-01","3802-07-01","3802-10-01","3803-01-01","3803-04-01",695239,null,30000,"do not change graduate supervisor limit"]
[null,null,null,null,null,null,null,null,null,null,null,null,null,null,null,null,null,null,null,"Actuals","Actuals","Actuals","Actuals",null,null,"Actuals","Actuals","Actuals","Actuals",null,null,"Actuals","Actuals","Actuals","Actuals",null,null,"Actuals","Actuals","Actuals","Actuals"]
[null,null,null,null,null,null,null,null,null,null,null,null,null,null,"2005-06-30","2006-06-30","2007-06-30","2008-06-30",null,null,null,null,null,null,null,null,null,null,null,null,null,null,null,null,null,null,null,null,null,null,null,null,"End Q","End Q",{"$f":"DATE(AS1,AS5,AS6)","v":"3799-10-01"},{"$f":"DATE(AT1,AT5,AT6)","v":"3800-01-01"},{"$f":"DATE(AU1,AU5,AU6)","v":"3800-04-01"},"3800-07-01","3800-10-01","3801-01-01","3801-04-01","3801-07-01","3801-10-01","3802-01-01","3802-04-01","3802-07-01","3802-10-01","3803-01-01","3803-04-01","3803-07-01",695331]
["Y","A. Salary (only employees directly working on project)",null,null,null,null,null,null,null,null,null,null,null,null,null,null,null,null,null,null,null,null,null,null,null,null,null,null,null,null,null,null,null,null,null,null,null,null,null,null,null,null,"Month+3","Month+3",{"$f":"MONTH(AS2)+3","v":10},{"$f":"MONTH(AT2)+3","v":13},{"$f":"MONTH(AU2)+3","v":4},7,10,13,4,7,10,13,4,7,10,13,4,7,10]
["N",null,null,null,null,null,null,null,null,null,null,null,null,null,"Expenditure by financial year",null,null,null,null,"Q1","Q2","Q3","Q4",null,null,"Q1","Q2","Q3","Q4",null,null,"Q1","Q2","Q3","Q4",null,null,"Q1","Q2","Q3","Q4",null,"Day","Day",{"$f":"DAY(AS2)","v":1},{"$f":"DAY(AT2)","v":1},{"$f":"DAY(AU2)","v":1},1,1,1,1,1,1,1,1,1,1,1,1,1,1]
{"$rows_left_out":54}
{"sheet":"Contract Expenditure","index":6,"n_rows":55,"n_cols":100,"rows_kept":55,"cut":false,"hidden":false,"merged":[[3,1,4,3],[7,59,7,62],[17,12,17,15],[25,2,27,2],[6,2,8,2],[5,12,5,15],[18,8,20,9],[21,8,21,9],[25,8,27,8],[6,9,8,9],[6,8,8,8],[25,9,27,9],[48,12,48,15],[36,12,36,15],[7,41,7,43],[24,12,24,15],[28,3,28,7],[46,3,46,6],[32,3,32,7],[6,3,8,3],[6,5,8,5],[25,3,27,7],[6,4,8,4],[6,7,8,7],[6,6,8,6],[30,3,30,7],[31,3,31,7],[29,3,29,7]]}
[null,{"$f":"IF(Summary!C3=\"\",\"\",Summary!C3)","v":""},null,null,null,null,"Project Period:",{"$f":"Summary!$C$4","v":"00:00:00"},"to",{"$f":"Summary!$C$5","v":"00:00:00"},null,null,null,null,null,null,null,null,null,null,null,null,null,null,null,null,null,null,null,null,null,null,null,null,null,null,null,null,null,null,"Year",{"$f":"YEAR(AP2)","v":3799},3799,3800,3800,3800,3800,3801,3801,3801,3801,3802,3802,3802,3802,3803,3803,3803]
[null,"2. Contract Expenditure",null,null,null,null,null,null,null,null,null,null,"2004-07-01","2005-07-01","2006-07-01","2007-07-01",null,null,null,null,null,null,null,null,null,null,null,null,null,null,null,null,null,null,null,null,null,null,null,null,"Start Q",{"$f":"Summary!F5","v":"3799-07-01"},{"$f":"AP4","v":"3799-10-01"},{"$f":"AQ4","v":"3800-01-01"},"3800-04-01","3800-07-01","3800-10-01","3801-01-01","3801-04-01","3801-07-01","3801-10-01","3802-01-01","3802-04-01","3802-07-01","3802-10-01","3803-01-01","3803-04-01","3803-07-01",null,null,"Drop down box"]
[null,null,null,null,null,null,null,null,null,null,null,null,null,null,null,null,null,"Actuals","Actuals","Actuals","Actuals",null,null,"Actuals","Actuals","Actuals","Actuals",null,null,"Actuals","Actuals","Actuals","Actuals",null,null,"Actuals","Actuals","Actuals","Actuals"]
[null,"A. Contract expenditure (contractors working more than 35hrs/week or more on premises)",null,null,null,null,null,null,null,null,null,null,"2005-06-30","2006-06-30","2007-06-30","2008-06-30",null,null,null,null,null,null,null,null,null,null,null,null,null,null,null,null,null,null,null,null,null,null,null,null,"End Q",{"$f":"DATE(AP1,AP5,AP6)","v":"3799-10-01"},{"$f":"DATE(AQ1,AQ5,AQ6)","v":"3800-01-01"},{"$f":"DATE(AR1,AR5,AR6)","v":"3800-04-01"},"3800-07-01","3800-10-01","3801-01-01","3801-04-01","3801-07-01","3801-10-01","3802-01-01","3802-04-01","3802-07-01","3802-10-01","3803-01-01","3803-04-01","3803-07-01","3803-10-01",null,null,"Y"]
[null,null,null,null,null,null,null,null,null,null,null,null,null,null,null,null,null,null,null,null,null,null,null,null,null,null,null,null,null,null,null,null,null,null,null,null,null,null,null,null,"Month+3",{"$f":"MONTH(AP2)+3","v":10},{"$f":"MONTH(AQ2)+3","v":13},{"$f":"MONTH(AR2)+3","v":4},7,10,13,4,7,10,13,4,7,10,13,4,7,10,null,null,"N"]
[null,null,null,null,null,null,null,null,null,null,null,null,"Expenditure by financial year",null,null,null,null,"Q1","Q2","Q3","Q4",null,null,"Q1","Q2","Q3","Q4",null,null,"Q1","Q2","Q3","Q4",null,null,"Q1","Q2","Q3","Q4",null,"Day",{"$f":"DAY(AP2)","v":1},{"$f":"DAY(AQ2)","v":1},{"$f":"DAY(AR2)","v":1},1,1,1,1,1,1,1,1,1,1,1,1,1,1]
{"$rows_left_out":50}
{"sheet":"Plant Expenditure","index":7,"n_rows":50,"n_cols":75,"rows_kept":50,"cut":false,"hidden":false,"merged":[[38,2,39,4],[38,5,39,9],[5,12,5,15],[17,12,17,15],[18,6,20,6],[18,8,20,8],[18,9,20,9],[6,7,8,7],[6,6,8,6],[18,4,20,4],[18,7,20,7],[6,2,8,2],[6,3,8,3],[6,4,8,4],[18,2,20,2],[18,3,20,3],[43,12,43,15],[6,9,8,9],[6,8,8,8],[28,12,28,15],[18,5,20,5],[6,5,8,5]]}
[null,{"$f":"IF(Summary!C3=\"\",\"\",Summary!C3)","v":""},null,null,null,"Project Period:",{"$f":"Summary!$C$4","v":"00:00:00"},"to",{"$f":"Summary!$C$5","v":"00:00:00"},{"$f":"Summary!$C$5","v":"00:00:00"},null,null,"Purchased","Hired","Leased"]
[null,"3. Plant Expenditure",null,null,null,null,null,null,null,{"$f":"Summary!$C$5","v":"00:00:00"}]
[null,null,null,null,null,null,null,null,null,null,null,null,null,null,null,null,null,"Actuals","Actuals","Actuals","Actuals",null,null,"Actuals","Actuals","Actuals","Actuals",null,null,"Actuals","Actuals","Actuals","Actuals",null,null,"Actuals","Actuals","Actuals","Actuals"]
[]
[null,"A. Purchased, pre-existing, hired or leased plant"]
[null,null,null,null,null,null,null,null,null,null,null,null,"Expenditure by financial year",null,null,null,null,"Q1","Q2","Q3","Q4",null,null,"Q1","Q2","Q3","Q4",null,null,"Q1","Q2","Q3","Q4",null,null,"Q1","Q2","Q3","Q4"]
{"$rows_left_out":45}
{"sheet":"SMP-PMP Expenditure","index":8,"n_rows":27,"n_cols":39,"rows_kept":27,"cut":false,"hidden":false,"merged":[[0,35,0,38],[20,23,20,26],[20,29,20,32],[20,35,20,38],[6,8,8,8],[6,9,8,9],[20,12,20,15],[20,17,20,20],[5,12,5,15],[0,12,0,15],[0,17,0,20],[0,23,0,26],[0,29,0,32],[6,7,8,7],[6,2,8,2],[6,3,8,3],[6,4,8,4],[6,5,8,5],[6,6,8,6]]}
[null,{"$f":"IF(Summary!C3=\"\",\"\",Summary!C3)","v":""},null,null,"Project Period:",{"$f":"Summary!$C$4","v":"00:00:00"},null,"to",{"$f":"Summary!$C$5","v":"00:00:00"}]
[null,"4. State-of-the-art Manufacturing Plant/Pilot Manufacturing Plant Expenditure"]
[null,null,null,null,null,null,null,null,null,null,null,null,null,null,null,null,null,"Actuals","Actuals","Actuals","Actuals",null,null,"Actuals","Actuals","Actuals","Actuals",null,null,"Actuals","Actuals","Actuals","Actuals",null,null,"Actuals","Actuals","Actuals","Actuals"]
[]
["General"]
["Overseas",null,null,null,null,null,null,null,null,null,null,null,"Expenditure by financial year",null,null,null,null,"Q1","Q2","Q3","Q4",null,null,"Q1","Q2","Q3","Q4",null,null,"Q1","Q2","Q3","Q4",null,null,"Q1","Q2","Q3","Q4"]
{"$rows_left_out":22}
{"sheet":"Prototype Expenditure","index":9,"n_rows":26,"n_cols":39,"rows_kept":26,"cut":false,"hidden":false,"merged":[[19,29,19,32],[19,35,19,38],[19,12,19,15],[19,17,19,20],[19,23,19,26],[5,12,5,15],[6,7,8,7],[6,8,8,8],[6,2,8,2],[6,3,8,3],[6,4,8,4],[6,5,8,5],[6,9,8,9],[6,6,8,6]]}
[null,{"$f":"IF(Summary!C3=\"\",\"\",Summary!C3)","v":""},null,null,null,"Project Period:",{"$f":"Summary!$C$4","v":"00:00:00"},null,"to",{"$f":"Summary!$C$5","v":"00:00:00"}]
[null,"5. Prototype Expenditure"]
[null,null,null,null,null,null,null,null,null,null,null,null,null,null,null,null,null,"Actuals","Actuals","Actuals","Actuals",null,null,"Actuals","Actuals","Actuals","Actuals",null,null,"Actuals","Actuals","Actuals","Actuals",null,null,"Actuals","Actuals","Actuals","Actuals"]
[]
[]
[null,null,null,null,null,null,null,null,null,null,null,null,"Expenditure by financial year",null,null,null,null,"Q1","Q2","Q3","Q4",null,null,"Q1","Q2","Q3","Q4",null,null,"Q1","Q2","Q3","Q4",null,null,"Q1","Q2","Q3","Q4"]
{"$rows_left_out":21}
{"sheet":"Other Expenditure","index":10,"n_rows":25,"n_cols":37,"rows_kept":25,"cut":false,"hidden":false,"merged":[[18,8,18,11],[6,2,8,2],[6,3,8,3],[5,8,5,11],[6,5,8,5],[6,4,8,4]]}
[null,{"$f":"IF(Summary!C3=\"\",\"\",Summary!C3)","v":""},null,null,"Project Period:",{"$f":"Summary!$C$4","v":"00:00:00"},null,"to",{"$f":"Summary!$C$5","v":"00:00:00"}]
[null,"6. Other Expenditure"]
[null,null,null,null,null,null,null,null,null,null,null,null,null,"Actuals","Actuals","Actuals","Actuals",null,0,"Actuals","Actuals","Actuals","Actuals",null,null,"Actuals","Actuals","Actuals","Actuals",null,null,"Actuals","Actuals","Actuals","Actuals"]
[null,null,null,null,null,null,null,null,null,null,null,null,null,null,null,null,null,null,null,null,null,null,null,null,null,null,null,null,null,null,null,null,null,null,null,null,"Travel"]
[null,null,null,null,null,null,null,null,null,null,null,null,null,null,null,null,null,null,null,null,null,null,null,null,null,null,null,null,null,null,null,null,null,null,null,null,"Training"]
[null,null,null,null,null,null,null,null,"Expenditure by financial year",null,null,null,null,"Q1","Q2","Q3","Q4",null,null,"Q1","Q2","Q3","Q4",null,null,"Q1","Q2","Q3","Q4",null,null,"Q1","Q2","Q3","Q4",null,"New and Leading Edge Technologies"]
{"$rows_left_out":20}
{"sheet":"Cash Flow","index":11,"n_rows":34,"n_cols":31,"rows_kept":34,"cut":false,"hidden":true,"merged":[[4,4,4,7],[30,6,30,7],[32,4,33,12],[2,2,3,5]]}
[]
[null,"8. Company Cash Flow"]
[null,null,"Please enter cash flow estimates for total company activity, not just proposed project"]
[]
[null,null,null,null,"Expenditure by financial year",null,null,null,null,"Q1","Q2","Q3","Q4",null,null,"Q1","Q2","Q3","Q4",null,null,"Q1","Q2","Q3","Q4",null,null,"Q1","Q2","Q3","Q4"]
[null,null,null,null,{"$f":"Summary!$J$21","v":"Enter Project Start Date"},{"$f":"Summary!$P$21","v":"Enter Project Start Date"},{"$f":"Summary!$V$21","v":"Enter Project Start Date"},{"$f":"Summary!$AB$21","v":"Enter Project Start Date"},null,{"$f":"Summary!$F$21","v":"Enter Project Start Date"},{"$f":"Summary!$G$21","v":"Enter Project Start Date"},{"$f":"Summary!$H$21","v":"Enter Project Start Date"},{"$f":"Summary!$I$21","v":"Enter Project Start Date"},null,null,{"$f":"Summary!$L$21","v":"Enter Project Start Date"},{"$f":"Summary!$M$21","v":"Enter Project Start Date"},{"$f":"Summary!$N$21","v":"Enter Project Start Date"},{"$f":"Summary!$O$21","v":"Enter Project Start Date"},null,null,{"$f":"Summary!$R$21","v":"Enter Project Start Date"},{"$f":"Summary!$S$21","v":"Enter Project Start Date"},{"$f":"Summary!$T$21","v":"Enter Project Start Date"},{"$f":"Summary!$U$21","v":"Enter Project Start Date"},null,null,{"$f":"Summary!$X$21","v":"Enter Project Start Date"},{"$f":"Summary!$Y$21","v":"Enter Project Start Date"},{"$f":"Summary!$Z$21","v":"Enter Project Start Date"},{"$f":"Summary!$AA$21","v":"Enter Project Start Date"}]
{"$rows_left_out":29}
{"sheet":"Guidelines","index":12,"n_rows":234,"n_cols":4,"rows_kept":234,"cut":false,"hidden":false,"merged":[[0,1,0,3]]}
[null,"Accelerating Commercialisation Eligible Expenditure Guidelines"]
[]
[]
[1,null,null,"Introduction"]
[null,null,null,"These guidelines operate on and from 1 November 2014. The Programme Delegate may revise these guidelines from time to time. The guidelines that apply to your project are those that apply on the date that your application is accepted for merit assessment (the date of the application acceptance letter)."]
[null,null,null,"These guidelines set out the principles governing what is eligible expenditure. Applicants for Accelerating Commercialisation must use these guidelines in completing an application. For guidance on project eligibility please refer to section 5 of the Accelerating Commercialisation Customer Information Guide."]
{"$rows_left_out":228}