{"text_format":"1","workbook":"xlsx","n_sheets":3,"sheets":["PDF Warrant","Warrant_transpose","Reference"],"not_rendered":{"charts":0,"images":1,"macros":1,"external_links":0,"defined_names":28,"comments":1,"pivot_tables":0},"unopened":[],"bounds":{"document_bytes":16777216,"sheet_cells":100000,"rows_first":2000,"rows_last":500,"rows_between":2000,"halvings":0,"cell_chars":16384,"cell_head_chars":4096},"cells_cut":0,"cells_raw":0,"read":"whole","date_system":"1900"}

{"sheet":"PDF Warrant","index":0,"n_rows":105,"n_cols":10,"rows_kept":105,"cut":false,"hidden":false,"merged":[[1,0,1,1],[102,1,102,10],[22,2,22,7],[0,0,0,10],[13,2,13,7],[15,2,15,3],[15,6,15,7],[19,2,20,10],[5,1,5,10],[24,2,24,3],[24,6,24,7],[24,9,26,10],[26,6,26,7],[28,2,28,3],[28,6,28,7],[56,6,56,7],[56,8,56,9],[29,1,29,7],[31,2,31,7],[33,2,33,3],[33,6,33,7],[35,2,35,4],[35,6,35,10],[37,6,37,8],[39,2,39,10],[43,2,43,3],[53,2,53,10],[55,1,55,3],[43,5,43,8],[41,5,41,8],[73,6,73,8],[81,1,81,2],[81,3,81,4],[61,8,61,9],[57,1,57,5],[57,6,57,7],[57,8,57,9],[58,1,58,5],[58,6,58,7],[58,8,58,9],[59,1,59,5],[59,6,59,7],[59,8,59,9],[60,1,60,5],[60,8,60,9],[69,1,69,4],[71,1,71,2],[71,3,71,4],[73,1,73,2],[73,3,73,4],[63,1,63,3],[64,1,64,2],[64,3,64,4],[64,6,64,8],[66,5,66,10],[104,1,104,7],[104,8,104,10],[99,1,99,10],[100,1,101,10],[93,2,93,4],[93,7,93,10],[95,1,96,1],[95,2,96,2],[95,3,96,4],[95,6,96,6],[95,7,96,8],[91,7,91,9],[79,9,79,10],[67,1,67,10],[75,6,75,8],[91,2,91,4],[83,1,83,2],[83,3,83,4],[83,6,83,8],[77,1,77,4],[79,1,79,2],[79,3,79,4],[79,6,79,8],[85,6,85,8],[89,2,89,10]]}
["Investments by Pooled Development Funds, including the exercising of options over shares, must be made in compliance with Part 4, Division 1of the PDF Act.  Please refer to the appropriate section of the PDF Act when providing the following information."]
["Please refer to the Privacy Policy"]
[]
["Pooled Development Funds:",null,null,null,null,"PDF Investment Notification Reporting Warrant"]
[]
["Notes: ","1) Information provided in this form is protected by section 71 of the Pooled Development Funds Act 1992 (PDF Act), and is used for internal reporting purposes and to evaluate Government initiatives or policies related to the PDF Act.  It does not represent an approval under the PDF Act. Funds should ensure they have obtained any necessary approvals and are compliant with the provisions of the PDF Act before providing this warrant."]
[null,"2) PDFs are expected to obtain as outlined in the Pooled Development Fund Act 1992, the necessary prior Board approvals applicable to certain investment situations."]
[null,"3) Cells whose label includes a double-border are mandatory."]
[null,"4) Cells whose label includes a single-border outline require a value in at least one of the fields on that line that have the border."]
[null,"5) Some cells will stop displaying if a preceeding answer means they don’t need to be completed."]
[]
[]
[]
["1.","PDF’s Name: (Select)"]
[]
[null,"ABN: (Enter without spaces. Will display with spaces added.)",{"$f":"IF(OR(ISBLANK($C$14),ISERROR(VLOOKUP($C$14,Reference!$P$5:$AP$29,2,FALSE)),ISBLANK(VLOOKUP($C$14,Reference!$P$5:$AP$29,2,FALSE))),\"\",VLOOKUP($C$14,Reference!$P$5:$AP$29,2,FALSE))","v":""},null,{"$f":"IF(ISBLANK(C16),\"\",IF(LEFT(C16,2)=QUOTIENT(89-MOD(((MID(C16,3,1)*3) +(MID(C16,4,1)*5) +(MID(C16,5,1)*7) +(MID(C16,6,1)*9) +(MID(C16,7,1)*11) +(MID(C16,8,1)*13) +(MID(C16,9,1)*15) +(MID(C16,10,1)*17) +(MID(C16,11,1)*19)),89),10)+1&MOD(89-MOD(((MID(C16,3,1)*3) +(MID(C16,4,1)*5) +(MID(C16,5,1)*7) +(MID(C16,6,1)*9) +(MID(C16,7,1)*11) +(MID(C16,8,1)*13) +(MID(C16,9,1)*15) +(MID(C16,10,1)*17) +(MID(C16,11,1)*19)),89),10),\"\",\"Invalid ABN Value\"))","v":{"$error":"#VALUE!"}},"ACN: (Enter without spaces)",{"$f":"IF(OR(ISBLANK($C$14),ISERROR(VLOOKUP($C$14,Reference!$P$5:$AP$29,3,FALSE)),ISBLANK(VLOOKUP($C$14,Reference!$P$5:$AP$29,3,FALSE))),\"\",VLOOKUP($C$14,Reference!$P$5:$AP$29,3,FALSE))","v":""},null,{"$f":"IF(VALUE(RIGHT(G16,1))=(VALUE(IF((((LEFT(G16,1)*8)+(MID(G16,2,1)*7) +(MID(G16,3,1)*6) +(MID(G16,4,1)*5) +(MID(G16,5,1)*4) +(MID(G16,6,1)*3) +(MID(G16,7,1)*2) +(MID(G16,8,1)*1))-((ROUNDDOWN(((LEFT(G16,1)*8)+(MID(G16,2,1)*7) +(MID(G16,3,1)*6) +(MID(G16,4,1)*5) +(MID(G16,5,1)*4) +(MID(G16,6,1)*3) +(MID(G16,7,1)*2) +(MID(G16,8,1)*1))/10,0))*10))=0,\"0\",(10-(((LEFT(G16,1)*8)+(MID(G16,2,1)*7) +(MID(G16,3,1)*6) +(MID(G16,4,1)*5) +(MID(G16,5,1)*4) +(MID(G16,6,1)*3) +(MID(G16,7,1)*2) +(MID(G16,8,1)*1))-((ROUNDDOWN(((LEFT(G16,1)*8)+(MID(G16,2,1)*7) +(MID(G16,3,1)*6) +(MID(G16,4,1)*5) +(MID(G16,5,1)*4) +(MID(G16,6,1)*3) +(MID(G16,7,1)*2) +(MID(G16,8,1)*1))/10,0))*10)))))),\"\",\"Invalid ACN Value\")","v":{"$error":"#VALUE!"}},"ASX Code:"]
[]
[]
[]
["2.","Investee Details:","To enable appropriate transparency and accountability in the program, it's important that participants are clearly and unambiguously identified and decribed. If you're uncertain of the answers to the following questions, please clarify with the investee."]
{"$rows_left_out":86}
{"sheet":"Warrant_transpose","index":1,"n_rows":2,"n_cols":58,"rows_kept":2,"cut":false,"hidden":true,"merged":[]}
["PDF’s Name","PDF's ABN","PDF's ACN","PDF's ASX","Initial or Follow-on","Date of investment","Investee Name","Investee ABN","Investee ACN","Investee ARBN","Investee State Rego","Investee State Registered In","Investee Address","Suburb","State","Postcode","Sector","ANZSIC CODE","Number of New Shares","Number of Pre-Owned Shares","Number of NTOs","Intended use by investee of money","Is the investee a PDF","Primary activity of investee","Total value of investee company's assets (s24) ","PDF investment in investee on this occasion"," Investee's paid up capital after the investment ","Percentage of the investees paid-up capital contributed by the PDF","If the initial investment represents less than 10%, which approval did the PDF receive to make the investment","PDFs shareholders funds","All amounts remaining unpaid on the issued shares in the PDF"," PDF's committed capital  ","PDF total commitment to investee (total of all debt and equity invested)","Percentage of PDFs committed capital committed to investee","If the investment represents more than 30%, when was PDF Board approval given?","Is the investee an interposed entity under s28A","If yes, does the investment satisfy the requirements of s28A","How much, in total from all sources, did the investee company raise at the time of the PDFs investment","What is the value of the PDFs investment as a percentage of the total capital raise?","What was the type of capital raising?","Form Signed?","Signatory's Name","Signatory's Position","Signatory's Phone Number","Signatory's email","Date Signed","Co-investor's name","Amount invested by co-investor  ","New Shares Transaction Value","Pre-Owned Shares Transaction Value","NTOs Transaction Value","Loans Transaction Value","Details of \"Other\" basis for the approval of initial invest less than 10%","Total paid by PDF for its current shareholding in this investee","If the investment represents less than 10%, when was PDF Board approval given?","Is the primary activity an excluded activity? [s23]","If the primary activity is an excluded activity, when did Innovation and Science Australia approve?","If the investee company's assets is more that $50 million, when did Innovation and Science Australia approve?"]
[{"$f":"'PDF Warrant'!$C$14","v":"00:00:00"},{"$f":"'PDF Warrant'!$C$16","v":""},{"$f":"'PDF Warrant'!$G$16","v":""},{"$f":"'PDF Warrant'!$K$16","v":0},{"$f":"'PDF Warrant'!$C$52","v":0},{"$f":"IF(NOT('PDF Warrant'!$G$52=0),'PDF Warrant'!$G$52,\"|\")","v":"|"},{"$f":"IF(NOT('PDF Warrant'!$C$23=0),'PDF Warrant'!$C$23,\"|\")","v":"|"},{"$f":"IF(NOT('PDF Warrant'!$C$25=0),'PDF Warrant'!$C$25,\"|\")","v":"|"},{"$f":"IF(NOT('PDF Warrant'!$G$25=0),'PDF Warrant'!$G$25,\"|\")","v":"|"},{"$f":"IF(NOT('PDF Warrant'!$G$27=0),'PDF Warrant'!$G$27,\"|\")","v":"|"},{"$f":"IF(NOT('PDF Warrant'!$C$29=0),'PDF Warrant'!$C$29,\"|\")","v":"|"},{"$f":"IF(NOT('PDF Warrant'!$G$29=0),'PDF Warrant'!$G$29,\"|\")","v":"|"},{"$f":"IF(NOT('PDF Warrant'!$C$32=0),'PDF Warrant'!$C$32,\"|\")","v":"|"},{"$f":"IF(NOT('PDF Warrant'!$G$34=0),'PDF Warrant'!$G$34,\"|\")","v":"|"},{"$f":"IF(NOT('PDF Warrant'!$C$34=0),'PDF Warrant'!$C$34,\"|\")","v":"|"},{"$f":"IF(NOT('PDF Warrant'!$K$34=0),'PDF Warrant'!$K$34,\"|\")","v":"|"},{"$f":"VLOOKUP('PDF Warrant'!$G$38,Reference!$A$5:$B$11,2,FALSE)","v":{"$error":"#N/A"}},{"$f":"LEFT('PDF Warrant'!$G$36,4)","v":""},{"$f":"IF(NOT('PDF Warrant'!$G$58=0),'PDF Warrant'!$G$58,\"|\")","v":"|"},{"$f":"IF(NOT('PDF Warrant'!$G$59=0),'PDF Warrant'!$G$59,\"|\")","v":"|"},{"$f":"IF(NOT('PDF Warrant'!$G$60=0),'PDF Warrant'!$G$60,\"|\")","v":"|"},{"$f":"IF(NOT('PDF Warrant'!$C$54=0),'PDF Warrant'!$C$54,\"|\")","v":"|"},{"$f":"IF(NOT('PDF Warrant'!$C$38=0),'PDF Warrant'!$C$38,\"|\")","v":"|"},{"$f":"IF(NOT('PDF Warrant'!$C$40=0),'PDF Warrant'!$C$40,\"|\")","v":"|"},{"$f":"IF(NOT('PDF Warrant'!$C$44=0),'PDF Warrant'!$C$44,\"|\")","v":"|"},{"$f":"'PDF Warrant'!$I$62","v":0},{"$f":"'PDF Warrant'!$D$74","v":0},{"$f":"IF(ISERROR('PDF Warrant'!$J$74),\"|\",'PDF Warrant'!$J$74)","v":"Data Incomplete"},null,{"$f":"'PDF Warrant'!$D$80","v":0},{"$f":"'PDF Warrant'!$J$80","v":0},{"$f":"'PDF Warrant'!$D$84","v":0},{"$f":"'PDF Warrant'!$D$82","v":0},{"$f":"IF(ISERROR('PDF Warrant'!$J$84),\"|\",'PDF Warrant'!$J$84)","v":"|"},{"$f":"IF(ISBLANK('PDF Warrant'!$J$86),\"|\",'PDF Warrant'!$J$86)","v":"|"},{"$f":"IF(ISBLANK('PDF Warrant'!$C$46),\"|\",'PDF Warrant'!$C$46)","v":"|"},{"$f":"IF(ISBLANK('PDF Warrant'!$G$46),\"|\",'PDF Warrant'!$G$46)","v":"|"},{"$f":"'PDF Warrant'!$D$65","v":0},{"$f":"IF(ISERROR('PDF Warrant'!$J$65),\"|\",'PDF Warrant'!$J$65)","v":"Data Incomplete"},{"$f":"IF(ISBLANK('PDF Warrant'!$F$67),\"|\",'PDF Warrant'!$F$67)","v":"|"},{"$f":"IF(ISBLANK('PDF Warrant'!$C$96),\"|\",'PDF Warrant'!$C$96)","v":"|"},{"$f":"IF(ISBLANK('PDF Warrant'!$C$92),\"|\",'PDF Warrant'!$C$92)","v":"|"},{"$f":"IF(ISBLANK('PDF Warrant'!$H$92),\"|\",'PDF Warrant'!$H$92)","v":"|"},{"$f":"IF(ISBLANK('PDF Warrant'!$C$94),\"|\",'PDF Warrant'!$C$94)","v":"|"},{"$f":"IF(ISBLANK('PDF Warrant'!$H$94),\"|\",'PDF Warrant'!$H$94)","v":"|"},{"$f":"IF(ISBLANK('PDF Warrant'!$H$96),\"|\",'PDF Warrant'!$H$96)","v":"|"},null,null,{"$f":"IF(ISBLANK('PDF Warrant'!$I$58),\"|\",'PDF Warrant'!$I$58)","v":"|"},{"$f":"IF(ISBLANK('PDF Warrant'!$I$59),\"|\",'PDF Warrant'!$I$59)","v":"|"},{"$f":"IF(ISBLANK('PDF Warrant'!$I$60),\"|\",'PDF Warrant'!$I$60)","v":"|"},{"$f":"IF(ISBLANK('PDF Warrant'!$I$61),\"|\",'PDF Warrant'!$I$61)","v":"|"},null,{"$f":"'PDF Warrant'!D72","v":0},{"$f":"IF(ISBLANK('PDF Warrant'!$J$76),\"|\",'PDF Warrant'!$J$76)","v":"|"},{"$f":"IF(ISBLANK('PDF Warrant'!$C$42),\"|\",'PDF Warrant'!$C$42)","v":"|"},{"$f":"IF(ISBLANK('PDF Warrant'!$J$42),\"|\",'PDF Warrant'!$J$42)","v":"|"},{"$f":"IF(ISBLANK('PDF Warrant'!$J$44),\"|\",'PDF Warrant'!$J$44)","v":"|"}]

{"sheet":"Reference","index":2,"n_rows":511,"n_cols":54,"rows_kept":511,"cut":false,"hidden":true,"merged":[]}
[null,null,null,null,null,null,null,null,null,null,null,null,null,null,null,null,null,null,null,null,null,null,null,null,null,null,null,null,null,null,null,null,null,null,null,null,null,null,null,null,null,null,null,null,null,null,null,null,"AU5&\" - \"&AV5","SUBSTITUTE(SUBSTITUTE(SUBSTITUTE(AW5,\" \",\"\"),\",\",\"\"),\"-\",\"_\")"]
["Sector ID lookup",null,null,"Investment Type lookup",null,null,"Under 10 pct Investment Type",null,null,null,"Investor Type",null,null,"Years",null,"Active PDF list",2,{"$f":"Q2+1","v":3},{"$f":"R2+1","v":4},5,6,7,8,9,10,11,12,13,14,15,16,17,18,19,20,21,22,23,24,25,26,27,null,null,"State",null,"ANZSIC (2006) v2.0"]
["Sector_Name","ID",null,"investment_type","Investment_type_id",null,"under10pct_type_id","under10pct_Code","under10pct_type",null,"investortype_id","investor_type",null,null,null,"org_name_registered","ABN","ACN","PDFId","org_id","rego_status","Former Name","ASX","Address: Street","Address: State","Address: City","Address: Postcode","PDF Landline","PDF Mobile","PDF Fax","PDF Email","PDF Website","Public: Street (if changed)","Public: State (if changed)","Public: City (if changed)","Public: Postcode (if changed)","Public: Ph. Number (if changed)","Public: Mobile (if changed)","Public: Fax (if changed)","Public: Email (if changed)","Public: Website (if changed)","Public: Target Investments",null,null,null,null,"1-digit parent","1-digit parent label","1-digit display label","For Range Names",null,"4-digit code","4-digit Code Label","4-digit Display Label"]
[null,null,null,null,null,null,null,null,null,null,null,null,null,2018,null,null,null,null,null,null,null,null,null,null,null,null,null,null,null,null,null,null,null,null,null,null,null,null,null,null,null,null,null,null,"ACT"]
["Agriculture/Aquaculture",4,null,"Loan",3,null,"Another named capital provider co-invested","E",5,null,"Domestic other",4,null,{"$f":"N4+1","v":2019},null,"Acrux Limited",72082001152,"082001152",145,2,7,null,null,null,null,null,null,null,null,null,null,null,null,null,null,null,null,null,null,null,null,null,null,null,"NSW",null,"A","Agriculture, Forestry and Fishing","A - Agriculture, Forestry and Fishing",{"$f":"SUBSTITUTE(SUBSTITUTE(SUBSTITUTE(AW5,\" \",\"\"),\",\",\"\"),\"-\",\"_\")","v":"A_AgricultureForestryandFishing"},null,"0111","Nursery Production (Under Cover)",{"$f":"AZ5&\" - \"&BA5","v":"0111 - Nursery Production (Under Cover)"}]
["Biotechnology, Pharmaceuticals and Health",5,null,"Loan and Pre-Owned shares",11,null,"Co-invest with another PDF","A",1,null,"Domestic super fund",3,null,{"$f":"N5+1","v":2020},null,"Australian Biomedical Fund No. 4 Limited",48117429795,"117429795",270,16,7,null,null,null,null,null,null,null,null,null,null,null,null,null,null,null,null,null,null,null,null,null,null,null,"NT",null,"B","Mining","B - Mining",{"$f":"SUBSTITUTE(SUBSTITUTE(SUBSTITUTE(AW6,\" \",\"\"),\",\",\"\"),\"-\",\"_\")","v":"B_Mining"},null,"0112","Nursery Production (Outdoors)",{"$f":"AZ6&\" - \"&BA6","v":"0112 - Nursery Production (Outdoors)"}]
["Energy and Mining",3,null,"New Shares",1,null,"Co-invest with another PDF, and Invest at least $500,000","A and C",7,null,"Non-resident other",2,null,2021,null,"Authorised Investment Fund Limited",51068793322,"068793322",92,25,7,null,null,null,null,null,null,null,null,null,null,null,null,null,null,null,null,null,null,null,null,null,null,null,"QLD",null,"C","Manufacturing","C - Manufacturing","C_Manufacturing",null,"0113","Turf Growing","0113 - Turf Growing"]
["Energy and Mining, and Biotechnology",7,null,"New Shares and Loan",6,null,"Invest at least $500,000","C",3,null,"Non-resident super fund",1,null,2022,null,"Avodah Capital Pty Ltd",49080975702,"080975702",91,180,7,null,null,null,null,null,null,null,null,null,null,null,null,null,null,null,null,null,null,null,null,null,null,null,"SA",null,"D","Electricity, Gas, Water and Waste Services","D - Electricity, Gas, Water and Waste Services","D_ElectricityGasWaterandWasteServices",null,"0114","Floriculture Production (Under Cover)","0114 - Floriculture Production (Under Cover)"]
["IT, Media, Electronics and Communications",6,null,"New Shares and Non-transferrable options",5,null,"Invested 9% of Investee ASX listing","F",6,null,null,null,null,2023,null,"BTC Health",45091979172,"091979172",146,29,7,null,null,null,null,null,null,null,null,null,null,null,null,null,null,null,null,null,null,null,null,null,null,null,"TAS",null,"E","Construction","E - Construction","E_Construction",null,"0115","Floriculture Production (Outdoors)","0115 - Floriculture Production (Outdoors)"]
["Manufacturing and Transport",1,null,"New Shares and Non-transferrable options and Loan",8,null,"Other","D",4,null,null,null,null,null,null,"Chesapeake Capital Limited",80106213772,"106213772",249,36,7,null,null,null,null,null,null,null,null,null,null,null,null,null,null,null,null,null,null,null,null,null,null,null,"VIC",null,"F","Wholesale Trade","F - Wholesale Trade","F_WholesaleTrade",null,"0121","Mushroom Growing","0121 - Mushroom Growing"]
["Services",2,null,"New Shares and Pre-Owned shares",7,null,"Underwrite or sub-underwrite the capital raising and the commitment was at least 10%","B",2,null,null,null,null,null,null,"Efficient Energy Australia Limited",71078867446,"078867446",154,58,7,null,null,null,null,null,null,null,null,null,null,null,null,null,null,null,null,null,null,null,null,null,null,null,"WA",null,"G","Retail Trade","G - Retail Trade","G_RetailTrade",null,"0122","Vegetable Growing (Under Cover)","0122 - Vegetable Growing (Under Cover)"]
[null,null,null,"Non-transferrable options",2,null,null,null,null,null,null,null,null,"Binary",null,"Family Partners Equity Pty Ltd",80070674234,"070674234",87,70,7,null,null,null,null,null,null,null,null,null,null,null,null,null,null,null,null,null,null,null,null,null,null,null,"O/S",null,"H","Accommodation and Food Services","H - Accommodation and Food Services","H_AccommodationandFoodServices",null,"0123","Vegetable Growing (Outdoors)","0123 - Vegetable Growing (Outdoors)"]
[null,null,null,"Non-transferrable options and Loan",9,null,null,null,null,null,null,null,null,null,null,"Future Capital Development Fund Limited",70081825470,"081825470",263,78,7,null,null,null,null,null,null,null,null,null,null,null,null,null,null,null,null,null,null,null,null,null,null,null,null,null,"I","Transport, Postal and Warehousing","I - Transport, Postal and Warehousing","I_TransportPostalandWarehousing",null,"0131","Grape Growing","0131 - Grape Growing"]
[null,null,null,"Non-transferrable options and Pre-Owned shares",10,null,null,null,null,null,null,null,null,"Yes",null,"Generation Development Group Limited",90087334370,"087334370",138,12,7,null,null,null,null,null,null,null,null,null,null,null,null,null,null,null,null,null,null,null,null,null,null,null,null,null,"J","Information Media and Telecommunications","J - Information Media and Telecommunications","J_InformationMediaandTelecommunications",null,"0132","Kiwifruit Growing","0132 - Kiwifruit Growing"]
[null,null,null,"Pre-Owned shares",4,null,null,null,null,null,null,null,null,"No",null,"Growthtech International Pty Ltd",69065951091,"065951091",59,87,7,null,null,null,null,null,null,null,null,null,null,null,null,null,null,null,null,null,null,null,null,null,null,null,null,null,"K","Financial and Insurance Services","K - Financial and Insurance Services","K_FinancialandInsuranceServices",null,"0133","Berry Fruit Growing","0133 - Berry Fruit Growing"]
[null,null,null,null,null,null,null,null,null,null,null,null,null,null,null,"HealthNet Investments Pty Limited",52088674846,"088674846",134,91,7,null,null,null,null,null,null,null,null,null,null,null,null,null,null,null,null,null,null,null,null,null,null,null,null,null,"L","Rental, Hiring and Real Estate Services","L - Rental, Hiring and Real Estate Services","L_RentalHiringandRealEstateServices",null,"0134","Apple and Pear Growing","0134 - Apple and Pear Growing"]
[null,null,null,null,null,null,null,null,null,null,null,null,null,null,null,"Incubator Capital Limited",66091499357,"091499357",135,100,7,null,null,null,null,null,null,null,null,null,null,null,null,null,null,null,null,null,null,null,null,null,null,null,null,null,"M","Professional, Scientific and Technical Services","M - Professional, Scientific and Technical Services","M_ProfessionalScientificandTechnicalServices",null,"0135","Stone Fruit Growing","0135 - Stone Fruit Growing"]
[null,null,null,null,null,null,null,null,null,null,null,null,null,null,null,"Innovation Capital Limited",39086439107,"086439107",80,101,7,null,null,null,null,null,null,null,null,null,null,null,null,null,null,null,null,null,null,null,null,null,null,null,null,null,"N","Administrative and Support Services","N - Administrative and Support Services","N_AdministrativeandSupportServices",null,"0136","Citrus Fruit Growing","0136 - Citrus Fruit Growing"]
[null,null,null,null,null,null,null,null,null,null,null,null,null,null,null,"Kestrel Growth Companies Limited",57072468798,"072468798",82,108,7,null,null,null,null,null,null,null,null,null,null,null,null,null,null,null,null,null,null,null,null,null,null,null,null,null,"O","Public Administration and Safety","O - Public Administration and Safety","O_PublicAdministrationandSafety",null,"0137","Olive Growing","0137 - Olive Growing"]
[null,null,null,"Notification Type lookup",null,null,"Under 10 pct Investment display lookup",null,null,null,null,null,null,null,null,"Match Development Fund Pty Ltd",16122203641,"122203641",279,119,7,null,null,null,null,null,null,null,null,null,null,null,null,null,null,null,null,null,null,null,null,null,null,null,null,null,"P","Education and Training","P - Education and Training","P_EducationandTraining",null,"0139","Other Fruit and Tree Nut Growing","0139 - Other Fruit and Tree Nut Growing"]
{"$rows_left_out":491}